BDBM50231281 1-(3-aminobenzo[d]isoxazol-5-yl)-6-{4-[(2-dimethylaminoethyl)pyridin-3-ylamino]-2-fluorophenyl}-7-fluoro-1H-indazole-3-carboxamide::CHEMBL251938
SMILES CN(C)CCN(c1cccnc1)c1ccc(c(F)c1)-c1ccc2c(nn(-c3ccc4onc(N)c4c3)c2c1F)C(N)=O
InChI Key InChIKey=LUFIRQURXPBAOK-UHFFFAOYSA-N
Data  1 KI
  Tab Delimited (TSV)   2D SDfile   Computed 3D by Vconf -m prep SDfile
Find this compound or compounds like it in BindingDB:
Activity Spreadsheet -- Enzyme Inhibition Constant Data from BindingDB
Found 1 hit for monomerid = 50231281
TargetCoagulation factor X(Homo sapiens (Human))
Johnson & Johnson Pharmaceutical Research And Development
Curated by ChEMBL
LigandPNGBDBM50231281(1-(3-aminobenzo[d]isoxazol-5-yl)-6-{4-[(2-dimethyl...)
Affinity DataKi:  231nM. Assay description: Inhibition of human factor 10a
In DepthDetails ArticlePubMed