BDBM50231463 CHEMBL1203091
SMILES Cl.Oc1nc2cc3cc(OCCCS(=O)(=O)N4CCN(Cc5ccc(F)cc5)CC4)ccc3[nH]c2n1
InChI Key InChIKey=JAJDVAOOUCCSCP-UHFFFAOYSA-N
Data  1 IC50
  Tab Delimited (TSV)   2D SDfile   Computed 3D by Vconf -m prep SDfile
Find this compound or compounds like it in BindingDB:
Activity Spreadsheet -- Enzyme Inhibition Constant Data from BindingDB
Found 1 hit for monomerid = 50231463
TargetcGMP-inhibited 3',5'-cyclic phosphodiesterase 3A/3B(Homo sapiens (Human))
Bristol-Myers Squibb Pharmaceutical Research Institute
Curated by ChEMBL
LigandPNGBDBM50231463(CHEMBL1203091)
Affinity DataIC50:  5nM. Assay description: Inhibition of human platelet aggregation cAMP PDE in vitro
In DepthDetails ArticlePubMed