BDBM50231517 CHEMBL1203068
SMILES Cl.CCC(CC)CN1CCN(CC1)S(=O)(=O)CCCOc1ccc2[nH]c3nc(O)nc3cc2c1
InChI Key InChIKey=RNLHXGYNSKVGGO-UHFFFAOYSA-N
Data  1 IC50
  Tab Delimited (TSV)   2D SDfile   Computed 3D by Vconf -m prep SDfile
Find this compound or compounds like it in BindingDB:
Activity Spreadsheet -- Enzyme Inhibition Constant Data from BindingDB
Found 1 hit for monomerid = 50231517
TargetcGMP-inhibited 3',5'-cyclic phosphodiesterase 3A/3B(Homo sapiens (Human))
Bristol-Myers Squibb Pharmaceutical Research Institute
Curated by ChEMBL
LigandPNGBDBM50231517(CHEMBL1203068)
Affinity DataIC50:  5.10nM. Assay description: Inhibition of human platelet aggregation cAMP PDE in vitro
In DepthDetails ArticlePubMed