BDBM50231541 CHEMBL1203069
SMILES Cl.Oc1nc2cc3cc(OCCCS(=O)(=O)N4CCN(CC5CCCCC5)CC4)ccc3[nH]c2n1
InChI Key InChIKey=FPLICEBMVDOYMA-UHFFFAOYSA-N
Data  1 IC50
  Tab Delimited (TSV)   2D SDfile   Computed 3D by Vconf -m prep SDfile
Find this compound or compounds like it in BindingDB:
Activity Spreadsheet -- Enzyme Inhibition Constant Data from BindingDB
Found 1 hit for monomerid = 50231541
TargetcGMP-inhibited 3',5'-cyclic phosphodiesterase 3A/3B(Homo sapiens (Human))
Bristol-Myers Squibb Pharmaceutical Research Institute
Curated by ChEMBL
LigandPNGBDBM50231541(CHEMBL1203069)
Affinity DataIC50:  2.60nM. Assay description: Inhibition of human platelet aggregation cAMP PDE in vitro
In DepthDetails ArticlePubMed