BDBM50231647 CHEMBL128288
SMILES CN1CCC(=CC1)c1c[nH]c2ccc(cc12)[Si](C)(C)C
InChI Key InChIKey=XOJMULROLUBKEA-UHFFFAOYSA-N
Data  2 KI
  Tab Delimited (TSV)   2D SDfile   Computed 3D by Vconf -m prep SDfile
Find this compound or compounds like it in BindingDB:
Activity Spreadsheet -- Enzyme Inhibition Constant Data from BindingDB
Found 2 hits for monomerid = 50231647
Target5-hydroxytryptamine receptor 1A(Rattus norvegicus (rat))
University Of Georgia
Curated by ChEMBL
LigandPNGBDBM50231647(CHEMBL128288)
Affinity DataKi:  165nM. Assay description: Binding affinity towards 5-hydroxytryptamine 1A receptor using [3H]8-OH-DPAT as radioligand.
In DepthDetails ArticlePubMed
TargetSerotonin 2 (5-HT2) receptor(RAT)
University Of Georgia
Curated by ChEMBL
LigandPNGBDBM50231647(CHEMBL128288)
Affinity DataKi:  219nM. Assay description: Binding affinity towards 5-hydroxytryptamine 2 receptor using [3H]-ketanserin as radioligand.
In DepthDetails ArticlePubMed