BDBM50231686 CHEMBL403820::N-((2S,3R)-4-(3,5-dimethoxybenzylamino)-3-hydroxy-1-phenylbutan-2-yl)-3-(ethylamino)-5-(2-oxopyrrolidin-1-yl)benzamide
SMILES CCNc1cc(cc(c1)C(=O)N[C@@H](Cc1ccccc1)[C@H](O)CNCc1cc(OC)cc(OC)c1)N1CCCC1=O
InChI Key InChIKey=YREYFYQYLVEDKG-XZWHSSHBSA-N
Data  3 IC50
  Tab Delimited (TSV)   2D SDfile   Computed 3D by Vconf -m prep SDfile
Find this compound or compounds like it in BindingDB:
Activity Spreadsheet -- Enzyme Inhibition Constant Data from BindingDB
Found 3 hits for monomerid = 50231686
TargetBeta-secretase 1(Homo sapiens (Human))
Glaxosmithkline
Curated by ChEMBL
LigandPNGBDBM50231686(CHEMBL403820 | N-((2S,3R)-4-(3,5-dimethoxybenzylam...)
Affinity DataIC50:  100nM. Assay description: Inhibition of BACE1
In DepthDetails ArticlePubMed
TargetBeta-secretase 2(Homo sapiens (Human))
Glaxosmithkline
Curated by ChEMBL
LigandPNGBDBM50231686(CHEMBL403820 | N-((2S,3R)-4-(3,5-dimethoxybenzylam...)
Affinity DataIC50:  6.92E+3nM. Assay description: Inhibition of BACE2
In DepthDetails ArticlePubMed
TargetCathepsin D(Homo sapiens (Human))
Glaxosmithkline
Curated by ChEMBL
LigandPNGBDBM50231686(CHEMBL403820 | N-((2S,3R)-4-(3,5-dimethoxybenzylam...)
Affinity DataIC50:  5.89E+3nM. Assay description: Inhibition of cathepsin D
In DepthDetails ArticlePubMed