BDBM50231779 5-(4-chlorophenyl)-N-(3-methylphenyl)furan-2-carboxamide::CHEMBL429663
SMILES Cc1cccc(NC(=O)c2ccc(o2)-c2ccc(Cl)cc2)c1
InChI Key InChIKey=DJDFKPIUUFKRNI-UHFFFAOYSA-N
Data  2 IC50
  Tab Delimited (TSV)   2D SDfile   Computed 3D by Vconf -m prep SDfile
Find this compound or compounds like it in BindingDB:
Activity Spreadsheet -- Enzyme Inhibition Constant Data from BindingDB
Found 2 hits for monomerid = 50231779
TargetPotassium voltage-gated channel subfamily H member 2(Homo sapiens (Human))
Abbott Laboratories
Curated by ChEMBL
LigandPNGBDBM50231779(5-(4-chlorophenyl)-N-(3-methylphenyl)furan-2-carbo...)
Affinity DataIC50:  2.70E+4nM. Assay description: Inhibition of hERG potassium channel expressed in CHO cells by isotope efflux assay
In DepthDetails ArticlePubMed
TargetSodium channel protein type 10 subunit alpha(Mus musculus)
Abbott Laboratories
Curated by ChEMBL
LigandPNGBDBM50231779(5-(4-chlorophenyl)-N-(3-methylphenyl)furan-2-carbo...)
Affinity DataIC50:  480nM. Assay description: Inhibition of mouse recombinant Nav 1.8 channel expressed in HEK293 cells by isotopic efflux assay
In DepthDetails ArticlePubMed