BDBM50231866 CHEMBL4094795
SMILES CN(C)[C@H]1CN(Cc2c(C)cccc2F)C[C@@H]1c1ccc(cc1)N1CCN(CC1)c1ncccn1
InChI Key InChIKey=KYPOWZHVHUPAKR-VPUSJEBWSA-N
Data  2 IC50
  Tab Delimited (TSV)   2D SDfile   Computed 3D by Vconf -m prep SDfile
Find this compound or compounds like it in BindingDB:
Activity Spreadsheet -- Enzyme Inhibition Constant Data from BindingDB
Found 2 hits for monomerid = 50231866
TargetPolycomb protein EED(Homo sapiens (Human))
Abbvie
Curated by ChEMBL
LigandPNGBDBM50231866(CHEMBL4094795)
Affinity DataIC50:  30nM. Assay description: Inhibition of pyrrolidine inhibitor-based oregon-green probe binding to GST-tagged EED (unknown origin) after 1 hr by assay explorer integrated Lanth...
In DepthDetails ArticlePubMed
TargetPolycomb protein EED(Homo sapiens (Human))
Abbvie
Curated by ChEMBL
LigandPNGBDBM50231866(CHEMBL4094795)
Affinity DataIC50:  70nM. Assay description: Inhibition of pyrrolidine inhibitor-based oregon-green probe binding to GST-tagged EED (unknown origin) after 1 hr by LanthaScreen TR-FRET assay
In DepthDetails ArticlePubMed