BDBM50231890 2-((2-carboxyethyl)carbamoyl)-6-methyl-3-phenethyl-1H-indole-5-carboxylic acid::CHEMBL252273
SMILES Cc1cc2[nH]c(C(=O)NCCC(O)=O)c(CCc3ccccc3)c2cc1C(O)=O
InChI Key InChIKey=KOZCWSDHKGGEBC-UHFFFAOYSA-N
Data  4 IC50
  Tab Delimited (TSV)   2D SDfile   Computed 3D by Vconf -m prep SDfile
Find this compound or compounds like it in BindingDB:
Activity Spreadsheet -- Enzyme Inhibition Constant Data from BindingDB
Found 4 hits for monomerid = 50231890
TargetBeta-2 adrenergic receptor(Homo sapiens (Human))
St. Jude Children'S Research Hospital
Curated by ChEMBL
LigandPNGBDBM50231890(2-((2-carboxyethyl)carbamoyl)-6-methyl-3-phenethyl...)
Affinity DataIC50:  8.20E+5nM. Assay description: Binding affinity to GST tagged human beta 2 adrenergic receptor PDZ1 domain
In DepthDetails ArticlePubMed
TargetSegment polarity protein dishevelled homolog DVL-3(Homo sapiens (Human))
St. Jude Children'S Research Hospital
Curated by ChEMBL
LigandPNGBDBM50231890(2-((2-carboxyethyl)carbamoyl)-6-methyl-3-phenethyl...)
Affinity DataIC50: >5.00E+5nM. Assay description: Antagonist activity at human Dvl3 assessed as inhibition of interaction between Dvl3 PDZ domain and Fz7 PDZ domain by alphaScreen assay
In DepthDetails ArticlePubMed
TargetSegment polarity protein dishevelled homolog DVL-1(Homo sapiens (Human))
St. Jude Children'S Research Hospital
Curated by ChEMBL
LigandPNGBDBM50231890(2-((2-carboxyethyl)carbamoyl)-6-methyl-3-phenethyl...)
Affinity DataIC50: >5.00E+5nM. Assay description: Antagonist activity at human Dvl1 assessed as inhibition of interaction between Dvl1 PDZ domain and Fz7 PDZ domain by alphaScreen assay
In DepthDetails ArticlePubMed
TargetCystic fibrosis transmembrane conductance regulator(Homo sapiens (Human))
St. Jude Children'S Research Hospital
Curated by ChEMBL
LigandPNGBDBM50231890(2-((2-carboxyethyl)carbamoyl)-6-methyl-3-phenethyl...)
Affinity DataIC50:  4.90E+5nM. Assay description: Binding affinity to GST tagged human CFTR PDZ2 domain
In DepthDetails ArticlePubMed