BDBM50232075 CHEMBL4069458
SMILES CCCn1c2nc([nH]c2c(=O)n(CCC)c1=O)-c1ccc(OCC2CN(C(=O)C2)c2ccc(F)cc2)cc1
InChI Key InChIKey=NGANUIJYSLZPQI-UHFFFAOYSA-N
Data  1 KI
  Tab Delimited (TSV)   2D SDfile   Computed 3D by Vconf -m prep SDfile
Find this compound or compounds like it in BindingDB:
Activity Spreadsheet -- Enzyme Inhibition Constant Data from BindingDB
Found 1 hit for monomerid = 50232075
TargetAdenosine receptor A2b(Homo sapiens (Human))
Advinus Therapeutics
Curated by ChEMBL
LigandPNGBDBM50232075(CHEMBL4069458)
Affinity DataKi:  5.40nM. Assay description: Displacement of [3H]-MRS-1754 from human adenosine receptor A2b expressed in HEK293 cell membranes after 90 mins by liquid scintillation counting met...
In DepthDetails ArticlePubMed