BDBM50232078 CHEMBL4080171
SMILES CCCn1c2nc([nH]c2c(=O)n(CCC)c1=O)-c1cnn(CC(=O)N2CCN(CC2)c2ccc(F)c(Cl)c2)c1
InChI Key InChIKey=PTCFANHNEXKGTO-UHFFFAOYSA-N
Data  1 KI
  Tab Delimited (TSV)   2D SDfile   Computed 3D by Vconf -m prep SDfile
Find this compound or compounds like it in BindingDB:
Activity Spreadsheet -- Enzyme Inhibition Constant Data from BindingDB
Found 1 hit for monomerid = 50232078
TargetAdenosine receptor A2b(Homo sapiens (Human))
Advinus Therapeutics
Curated by ChEMBL
LigandPNGBDBM50232078(CHEMBL4080171)
Affinity DataKi:  1.80nM. Assay description: Displacement of [3H]-MRS-1754 from human adenosine receptor A2b expressed in HEK293 cell membranes after 90 mins by liquid scintillation counting met...
In DepthDetails ArticlePubMed