BDBM50232082 CHEMBL4061490
SMILES CCCn1c2nc([nH]c2c(=O)n(CCC)c1=O)-c1cnn(CC2CN(C(=O)C2)c2cccc(OC(F)(F)F)c2)c1
InChI Key InChIKey=CLNFCAXZCSTYNE-UHFFFAOYSA-N
Data  1 KI
  Tab Delimited (TSV)   2D SDfile   Computed 3D by Vconf -m prep SDfile
Find this compound or compounds like it in BindingDB:
Activity Spreadsheet -- Enzyme Inhibition Constant Data from BindingDB
Found 1 hit for monomerid = 50232082
TargetAdenosine receptor A2b(Homo sapiens (Human))
Advinus Therapeutics
Curated by ChEMBL
LigandPNGBDBM50232082(CHEMBL4061490)
Affinity DataKi:  9nM. Assay description: Displacement of [3H]-MRS-1754 from human adenosine receptor A2b expressed in HEK293 cell membranes after 90 mins by liquid scintillation counting met...
In DepthDetails ArticlePubMed