BDBM50232107 CHEMBL4077041
SMILES Oc1ccc(F)c(C(=O)c2ccc(s2)-c2cc(Cl)c(O)c(Cn3ccnn3)c2)c1F
InChI Key InChIKey=NGABAMBZRFIVJJ-UHFFFAOYSA-N
Data  2 IC50
  Tab Delimited (TSV)   2D SDfile   Computed 3D by Vconf -m prep SDfile
Find this compound or compounds like it in BindingDB:
Activity Spreadsheet -- Enzyme Inhibition Constant Data from BindingDB
Found 2 hits for monomerid = 50232107
Target17-beta-hydroxysteroid dehydrogenase type 1(Homo sapiens (Human))
Saarland University
Curated by ChEMBL
LigandPNGBDBM50232107(CHEMBL4077041)
Affinity DataIC50:  18nM. Assay description: Inhibition of human placental cytosolic 17beta-HSD1 assessed as reduction in activation of [2,4,6,7-3H]-E1 substrate to E2 after 10 mins in presence ...
In DepthDetails ArticlePubMed
Target17-beta-hydroxysteroid dehydrogenase type 2(Homo sapiens (Human))
Saarland University
Curated by ChEMBL
LigandPNGBDBM50232107(CHEMBL4077041)
Affinity DataIC50:  26nM. Assay description: Inhibition of human placental microsomal 17beta-HSD2 using [2,4,6,7-3H]-E2 as substrate after 20 mins in presence of NAD+ by RP-HPLC method
In DepthDetails ArticlePubMed