BDBM50232209 CHEMBL4096447
SMILES CCCc1nc2ccc(cc2n1Cc1ccc(cc1)-c1ccccc1C(O)=O)-c1ccc(OC)cc1
InChI Key InChIKey=DQGDCPKSXDTGCI-UHFFFAOYSA-N
Data  1 EC50
  Tab Delimited (TSV)   2D SDfile   Computed 3D by Vconf -m prep SDfile
Find this compound or compounds like it in BindingDB:
Activity Spreadsheet -- Enzyme Inhibition Constant Data from BindingDB
Found 1 hit for monomerid = 50232209
TargetPeroxisome proliferator-activated receptor gamma(Homo sapiens (Human))
University Of Innsbruck
Curated by ChEMBL
LigandPNGBDBM50232209(CHEMBL4096447)
Affinity DataEC50:  1.01E+3nM. Assay description: Transactivation of Gal4 fused human PPARgamma LBD expressed in African green monkey COS7 cells after 42 hrs by dual luciferase reporter gene assay
In DepthDetails ArticlePubMed