BDBM50232213 CHEMBL4069460
SMILES CCCc1nc2ccc(cc2n1Cc1ccc(cc1)-c1ccccc1C(O)=O)-c1ccccc1Cl
InChI Key InChIKey=XIFDQXQCWHXVIY-UHFFFAOYSA-N
Data  1 EC50
  Tab Delimited (TSV)   2D SDfile   Computed 3D by Vconf -m prep SDfile
Find this compound or compounds like it in BindingDB:
Activity Spreadsheet -- Enzyme Inhibition Constant Data from BindingDB
Found 1 hit for monomerid = 50232213
TargetPeroxisome proliferator-activated receptor gamma(Homo sapiens (Human))
University Of Innsbruck
Curated by ChEMBL
LigandPNGBDBM50232213(CHEMBL4069460)
Affinity DataEC50:  1.39E+3nM. Assay description: Transactivation of Gal4 fused human PPARgamma LBD expressed in African green monkey COS7 cells after 42 hrs by dual luciferase reporter gene assay
In DepthDetails ArticlePubMed