BDBM50232317 CHEMBL4091284
SMILES Clc1ccc2nc(Cc3nnc(Cc4ccccc4)o3)[nH]c2c1
InChI Key InChIKey=MGBYFKQHWAHEEY-UHFFFAOYSA-N
Data  2 IC50
  Tab Delimited (TSV)   2D SDfile   Computed 3D by Vconf -m prep SDfile
Find this compound or compounds like it in BindingDB:
Activity Spreadsheet -- Enzyme Inhibition Constant Data from BindingDB
Found 2 hits for monomerid = 50232317
TargetEpidermal growth factor receptor(Homo sapiens (Human))
Hamdard University
Curated by ChEMBL
LigandPNGBDBM50232317(CHEMBL4091284)
Affinity DataIC50:  1.00E+5nM. Assay description: Inhibition of EGF induced EGFR phosphorylation in human KB cells preincubated for 90 mins followed by EGF addition for 5 mins by sandwich ELISA metho...
In DepthDetails ArticlePubMed
TargetEpidermal growth factor receptor(Homo sapiens (Human))
Hamdard University
Curated by ChEMBL
LigandPNGBDBM50232317(CHEMBL4091284)
Affinity DataIC50: >1.00E+5nM. Assay description: Inhibition of EGF induced EGFR phosphorylation in human KB cells preincubated for 90 mins followed by EGF addition for 5 mins by sandwich ELISA metho...
In DepthDetails ArticlePubMed