BDBM50232336 CHEMBL4068814
SMILES CC(=O)c1ccccc1-c1nnc(Cc2nc3ccccc3[nH]2)o1
InChI Key InChIKey=KCFCLUVAFZLFIE-UHFFFAOYSA-N
Data  2 IC50
  Tab Delimited (TSV)   2D SDfile   Computed 3D by Vconf -m prep SDfile
Find this compound or compounds like it in BindingDB:
Activity Spreadsheet -- Enzyme Inhibition Constant Data from BindingDB
Found 2 hits for monomerid = 50232336
TargetEpidermal growth factor receptor(Homo sapiens (Human))
Hamdard University
Curated by ChEMBL
LigandPNGBDBM50232336(CHEMBL4068814)
Affinity DataIC50:  6.55E+4nM. Assay description: Inhibition of EGF induced EGFR phosphorylation in human KB cells preincubated for 90 mins followed by EGF addition for 5 mins by sandwich ELISA metho...
In DepthDetails ArticlePubMed
TargetEpidermal growth factor receptor(Homo sapiens (Human))
Hamdard University
Curated by ChEMBL
LigandPNGBDBM50232336(CHEMBL4068814)
Affinity DataIC50:  6.54E+4nM. Assay description: Inhibition of EGF induced EGFR phosphorylation in human KB cells preincubated for 90 mins followed by EGF addition for 5 mins by sandwich ELISA metho...
In DepthDetails ArticlePubMed