BDBM50232386 CHEMBL4068635
SMILES Cc1nn(c2NC(=O)CC(C(=O)Nc3ccccc3)c12)-c1ncnc2nc[nH]c12
InChI Key InChIKey=HTMOXTOHWAOUCQ-UHFFFAOYSA-N
Data  1 EC50
  Tab Delimited (TSV)   2D SDfile   Computed 3D by Vconf -m prep SDfile
Find this compound or compounds like it in BindingDB:
Activity Spreadsheet -- Enzyme Inhibition Constant Data from BindingDB
Found 1 hit for monomerid = 50232386
TargetG-protein coupled receptor 39(Homo sapiens (Human))
University Of Copenhagen
Curated by ChEMBL
LigandPNGBDBM50232386(CHEMBL4068635)
Affinity DataEC50:  10nM. Assay description: Agonist activity at human GPR39 expressed in HEK293 cells co-expressing Galphaq assessed as myo-[2-3H]inositol phosphate accumulation in presence of ...
In DepthDetails ArticlePubMed