BDBM50232418 CHEMBL4084327
SMILES NC(=N)NCCC[C@@H]1NC(=O)[C@@H](Cc2ccccc2)NC(=O)[C@@H]2CCCN2C(=O)[C@H]2CCCN2C(=O)[C@H](Cc2c[nH]c3ccccc23)NC1=O
InChI Key InChIKey=HVICDAHQGJLSFQ-PBIKNJLJSA-N
Data  2 EC50
  Tab Delimited (TSV)   2D SDfile   Computed 3D by Vconf -m prep SDfile
Find this compound or compounds like it in BindingDB:
Activity Spreadsheet -- Enzyme Inhibition Constant Data from BindingDB
Found 2 hits for monomerid = 50232418
TargetMelanocyte-stimulating hormone receptor(Mus musculus)
University Of Minnesota
Curated by ChEMBL
LigandPNGBDBM50232418(CHEMBL4084327)
Affinity DataEC50:  1.80E+3nM. Assay description: Agonist activity at mouse MC1R expressed in HEK293 cells assessed as increase in forskolin-induced cAMP accumulation preincubated for 2 hrs followed ...
In DepthDetails ArticlePubMed
TargetMelanocortin receptor 3(Mus musculus)
University Of Minnesota
Curated by ChEMBL
LigandPNGBDBM50232418(CHEMBL4084327)
Affinity DataEC50: >1.00E+5nM. Assay description: Agonist activity at mouse MC3R expressed in HEK293 cells assessed as increase in forskolin-induced cAMP accumulation preincubated for 2 hrs followed ...
In DepthDetails ArticlePubMed