BDBM50232547 CHEMBL4065183
SMILES OC(=O)c1ccc(CNC(=O)c2cc(Cl)cnc2Oc2ccc(F)cc2)cc1
InChI Key InChIKey=DJRNTZODJOPRSE-UHFFFAOYSA-N
Data  5 IC50
  Tab Delimited (TSV)   2D SDfile   Computed 3D by Vconf -m prep SDfile
Find this compound or compounds like it in BindingDB:
Activity Spreadsheet -- Enzyme Inhibition Constant Data from BindingDB
Found 5 hits for monomerid = 50232547
TargetProstaglandin E2 receptor EP4 subtype(Homo sapiens (Human))
Askat
Curated by ChEMBL
LigandPNGBDBM50232547(CHEMBL4065183)
Affinity DataIC50:  38nM. Assay description: Antagonist activity at human EP4 receptor expressed in HEK293 cells assessed as inhibition of PGE2-induced cAMP level by HTS assay
In DepthDetails ArticlePubMed
TargetProstaglandin E2 receptor EP2 subtype(Homo sapiens (Human))
Askat
Curated by ChEMBL
LigandPNGBDBM50232547(CHEMBL4065183)
Affinity DataIC50:  1.29E+3nM. Assay description: Antagonist activity at human EP2 receptor
In DepthDetails ArticlePubMed
TargetProstaglandin E2 receptor EP3 subtype(Homo sapiens (Human))
Askat
Curated by ChEMBL
LigandPNGBDBM50232547(CHEMBL4065183)
Affinity DataIC50: >2.00E+4nM. Assay description: Antagonist activity at human EP3 receptor
In DepthDetails ArticlePubMed
TargetProstaglandin E2 receptor EP4 subtype(Homo sapiens (Human))
Askat
Curated by ChEMBL
LigandPNGBDBM50232547(CHEMBL4065183)
Affinity DataIC50:  254nM. Assay description: Antagonist activity at human EP4 receptor expressed in HEK293 cells assessed as inhibition of PGE2-induced cAMP level by HTS assay
In DepthDetails ArticlePubMed
TargetProstaglandin E2 receptor EP1 subtype(Homo sapiens (Human))
Askat
Curated by ChEMBL
LigandPNGBDBM50232547(CHEMBL4065183)
Affinity DataIC50: >2.00E+4nM. Assay description: Antagonist activity at human EP1 receptor
In DepthDetails ArticlePubMed