BDBM50232694 CHEMBL4079586::US11358936, Compound 4-2
SMILES NCc1ccncc1F
InChI Key InChIKey=YPJQSIDUEOBFTE-UHFFFAOYSA-N
Data  2 IC50
  Tab Delimited (TSV)   2D SDfile   Computed 3D by Vconf -m prep SDfile
Find this compound or compounds like it in BindingDB:
Activity Spreadsheet -- Enzyme Inhibition Constant Data from BindingDB
Found 2 hits for monomerid = 50232694
TargetLysyl oxidase homolog 2(Homo sapiens (Human))
Pharmakea
US Patent
LigandPNGBDBM50232694(CHEMBL4079586 | US11358936, Compound 4-2)
Affinity DataIC50:  650nM. Assay description: LOXL2 amine oxidase activity is evaluated by measuring Amplex Red fluorescence using 10-20× concentrated conditioned media from CHO cells stably expr...
In DepthDetails US Patent
TargetLysyl oxidase homolog 2(Homo sapiens (Human))
Pharmakea
US Patent
LigandPNGBDBM50232694(CHEMBL4079586 | US11358936, Compound 4-2)
Affinity DataIC50:  431nM. Assay description: Inhibition of full length recombinant human LOXL2 expressed in CHO cells assessed as reduction in H2O2 production using DAP as substrate preincubated...
In DepthDetails ArticlePubMed