BDBM50232839 CHEMBL4104897
SMILES CN(C)CCN\C(C)=C1/C(=O)C=C2Oc3c(c(O)c(C)c(O)c3C(C)=O)C2(C)C1=O
InChI Key InChIKey=MVPMNWPUCQNSDZ-RVDMUPIBSA-N
Data  1 IC50
  Tab Delimited (TSV)   2D SDfile   Computed 3D by Vconf -m prep SDfile
Find this compound or compounds like it in BindingDB:
Activity Spreadsheet -- Enzyme Inhibition Constant Data from BindingDB
Found 1 hit for monomerid = 50232839
TargetTyrosyl-DNA phosphodiesterase 1(Homo sapiens (Human))
Siberian Branch Of The Russian Academy Of Sciences
Curated by ChEMBL
LigandPNGBDBM50232839(CHEMBL4104897)
Affinity DataIC50: >1.00E+5nM. Assay description: Inhibition of recombinant TDP1 (unknown origin) using 5'-(5,6 FAM-aac gtc agg gtc ttc c-BHQ1)-3' as substrate measured at 1 min interval by fluorimet...
In DepthDetails ArticlePubMed