BDBM50232887 CHEMBL4096505
SMILES [H][C@]12C[C@@]3([H])C4=CCO[C@@]5([H])\C(=N/OCC(=O)OC)C(=O)N6c7ccccc7[C@@]1(CCN2C4)[C@]6([H])[C@@]35[H]
InChI Key InChIKey=ZKLHAXAVCMWFHX-YFEIEMJMSA-N
Data  4 IC50
  Tab Delimited (TSV)   2D SDfile   Computed 3D by Vconf -m prep SDfile
Find this compound or compounds like it in BindingDB:
Activity Spreadsheet -- Enzyme Inhibition Constant Data from BindingDB
Found 4 hits for monomerid = 50232887
TargetGlycine receptor subunit alpha-1/beta(Homo sapiens (Human))
The German University In Cairo
Curated by ChEMBL
LigandPNGBDBM50232887(CHEMBL4096505)
Affinity DataIC50:  661nM. Assay description: Antagonist activity at recombinant human glycine receptor alpha 1 beta expressed in human tsA201 cells assessed as inhibition of glycine-induced rece...
In DepthDetails ArticlePubMed
TargetGlycine receptor subunit alpha-1(Homo sapiens (Human))
The German University In Cairo
Curated by ChEMBL
LigandPNGBDBM50232887(CHEMBL4096505)
Affinity DataIC50:  220nM. Assay description: Antagonist activity at recombinant human glycine receptor alpha 1 expressed in human tsA201 cells assessed as inhibition of glycine-induced receptor ...
In DepthDetails ArticlePubMed
TargetGlycine receptor subunit alpha-1(Homo sapiens (Human))
The German University In Cairo
Curated by ChEMBL
LigandPNGBDBM50232887(CHEMBL4096505)
Affinity DataIC50:  224nM. Assay description: Antagonist activity at recombinant human glycine receptor alpha 1 expressed in human tsA201 cells assessed as inhibition of glycine-induced receptor ...
In DepthDetails ArticlePubMed
TargetGlycine receptor subunit alpha-1/beta(Homo sapiens (Human))
The German University In Cairo
Curated by ChEMBL
LigandPNGBDBM50232887(CHEMBL4096505)
Affinity DataIC50:  670nM. Assay description: Antagonist activity at recombinant human glycine receptor alpha 1 beta expressed in human tsA201 cells assessed as inhibition of glycine-induced rece...
In DepthDetails ArticlePubMed