BDBM50233077 1-isobutyl-8-(1-((5-(4-(trifluoromethyl)phenyl)-1,2,4-oxadiazol-3-yl)methyl)-1H-pyrazol-4-yl)-1H-purine-2,6(3H,7H)-dione::CHEMBL401834
SMILES CC(C)Cn1c(=O)[nH]c2nc([nH]c2c1=O)-c1cnn(Cc2noc(n2)-c2ccc(cc2)C(F)(F)F)c1
InChI Key InChIKey=DLJCOAYSXAVQNE-UHFFFAOYSA-N
Data  4 KI
  Tab Delimited (TSV)   2D SDfile   Computed 3D by Vconf -m prep SDfile
Find this compound or compounds like it in BindingDB:
Activity Spreadsheet -- Enzyme Inhibition Constant Data from BindingDB
Found 4 hits for monomerid = 50233077
TargetAdenosine receptor A2b(Homo sapiens (Human))
Cv Therapeutics
Curated by ChEMBL
LigandPNGBDBM50233077(1-isobutyl-8-(1-((5-(4-(trifluoromethyl)phenyl)-1,...)
Affinity DataKi:  14nM. Assay description: Displacement of [3H]-ZM241385 from human A2B receptor expressed in HEK293 cell membranes
In DepthDetails ArticlePubMed
TargetAdenosine receptor A2a(Homo sapiens (Human))
Cv Therapeutics
Curated by ChEMBL
LigandPNGBDBM50233077(1-isobutyl-8-(1-((5-(4-(trifluoromethyl)phenyl)-1,...)
Affinity DataKi: >5.00E+3nM. Assay description: Displacement of [3H]ZM241385 from human A2A receptor expressed in HEK293 cell membranes
In DepthDetails ArticlePubMed
TargetAdenosine receptor A1(Homo sapiens (Human))
Cv Therapeutics
Curated by ChEMBL
LigandPNGBDBM50233077(1-isobutyl-8-(1-((5-(4-(trifluoromethyl)phenyl)-1,...)
Affinity DataKi: >6.00E+3nM. Assay description: Displacement of [3H]-CPX from human A1 receptor expressed in CHO cell membranes
In DepthDetails ArticlePubMed
TargetAdenosine receptor A3(Homo sapiens (Human))
Cv Therapeutics
Curated by ChEMBL
LigandPNGBDBM50233077(1-isobutyl-8-(1-((5-(4-(trifluoromethyl)phenyl)-1,...)
Affinity DataKi: >9.00E+3nM. Assay description: Displacement of [125I]-AB-MECA from human A3 receptor expressed in CHO cells
In DepthDetails ArticlePubMed