BDBM50233198 CHEMBL4082280
SMILES Clc1ccc(OC2=CC(=O)C(=O)c3ccccc23)cc1
InChI Key InChIKey=STEALYWFJKSLPQ-UHFFFAOYSA-N
Data  2 KI
  Tab Delimited (TSV)   2D SDfile   Computed 3D by Vconf -m prep SDfile
Find this compound or compounds like it in BindingDB:
Activity Spreadsheet -- Enzyme Inhibition Constant Data from BindingDB
Found 2 hits for monomerid = 50233198
TargetLiver carboxylesterase 1(Homo sapiens (Human))
St. Jude Children'S Research Hospital
Curated by ChEMBL
LigandPNGBDBM50233198(CHEMBL4082280)
Affinity DataKi:  19nM. Assay description: Induction of ERalpha degradation in tamoxifen-sensitive human MCF7:WS8 cells after 24 hrs by CellTag 700 staining based In-cell western assay
In DepthDetails ArticlePubMed
TargetCocaine esterase(Homo sapiens (Human))
St. Jude Children'S Research Hospital
Curated by ChEMBL
LigandPNGBDBM50233198(CHEMBL4082280)
Affinity DataKi:  127nM. Assay description: Inhibition of human intestinal CES2 expressed in baculovirus infected sf9 cells using o-nitrophenyl acetate as substrate monitored at 15 secs interva...
In DepthDetails ArticlePubMed