BDBM50233246 CHEMBL4084200
SMILES CC(C)Cc1cc(no1)C(=O)N[C@H]1COc2ccccc2N(C)C1=O
InChI Key InChIKey=BNFZELRXWKQQTE-AWEZNQCLSA-N
Data  2 IC50
  Tab Delimited (TSV)   2D SDfile   Computed 3D by Vconf -m prep SDfile
Find this compound or compounds like it in BindingDB:
Activity Spreadsheet -- Enzyme Inhibition Constant Data from BindingDB
Found 2 hits for monomerid = 50233246
TargetReceptor-interacting serine/threonine-protein kinase 1(Homo sapiens (Human))
Queen Mary University Of London
Curated by ChEMBL
LigandPNGBDBM50233246(CHEMBL4084200)
Affinity DataIC50:  1.60E+3nM. Assay description: Displacement of (14-(2-{[3-({2-{[4-(cyanomethyl)phenyl]amino}-6-[(5-cyclopropyl-1H-pyrazol-3-yl)-amino]-4-pyrimidinyl}amino)propyl]amino}-2-oxoethyl)...
In DepthDetails ArticlePubMed
TargetReceptor-interacting serine/threonine-protein kinase 1(Homo sapiens (Human))
Queen Mary University Of London
Curated by ChEMBL
LigandPNGBDBM50233246(CHEMBL4084200)
Affinity DataIC50:  6.31E+3nM. Assay description: Inhibition of RIP1 in human U937 cells assessed as reduction in TNFalpha/QVD-Oph-induced necrosis after 24 hrs by Cell Titer-Glo luminescent cell via...
In DepthDetails ArticlePubMed