BDBM50233330 CHEMBL4068172
SMILES [H][C@@]12CCC(C(C)CCCC(C)(C)O)[C@@]1(C)CCC\C2=C/C=C1/C[C@@H](O)C[C@H](O)C1=C
InChI Key InChIKey=GMRQFYUYWCNGIN-HODNKNCGSA-N
Data  1 IC50  1 EC50
  Tab Delimited (TSV)   2D SDfile   Computed 3D by Vconf -m prep SDfile
Find this compound or compounds like it in BindingDB:
Activity Spreadsheet -- Enzyme Inhibition Constant Data from BindingDB
Found 2 hits for monomerid = 50233330
TargetVitamin D3 receptor(Homo sapiens (Human))
China Pharmaceutical University
Curated by ChEMBL
LigandPNGBDBM50233330(CHEMBL4068172)
Affinity DataEC50:  8.10nM. Assay description: Agonist activity at VDR in human HL60 cells assessed as induction of cell differentiation by measuring increase in NBT positive cells by Wright stain...
In DepthDetails ArticlePubMed
TargetVitamin D3 receptor(Homo sapiens (Human))
China Pharmaceutical University
Curated by ChEMBL
LigandPNGBDBM50233330(CHEMBL4068172)
Affinity DataIC50:  1.10nM. Assay description: Inhibition of Fluormone VDR Red binding to human VDR LBD expressed in insect cells assessed as binding ability by fluorescence polarization assay
In DepthDetails ArticlePubMed