BDBM50233390 CHEMBL4097968
SMILES Nc1nccn2c(nc(-c3ccc(cc3)C(=O)Nc3cc(ccn3)C(F)(F)F)c12)[C@H]1CC[C@@H](CC1)C(O)=O
InChI Key InChIKey=YZLMBXMJXHFDPM-JCNLHEQBSA-N
Data  2 IC50
  Tab Delimited (TSV)   2D SDfile   Computed 3D by Vconf -m prep SDfile
Find this compound or compounds like it in BindingDB:
Activity Spreadsheet -- Enzyme Inhibition Constant Data from BindingDB
Found 2 hits for monomerid = 50233390
TargetTyrosine-protein kinase BTK(Homo sapiens (Human))
Merck
Curated by ChEMBL
LigandPNGBDBM50233390(CHEMBL4097968)
Affinity DataIC50:  77nM. Assay description: Inhibition of BTK in human PBMC
In DepthDetails ArticlePubMed
TargetTyrosine-protein kinase BTK(Homo sapiens (Human))
Merck
Curated by ChEMBL
LigandPNGBDBM50233390(CHEMBL4097968)
Affinity DataIC50:  1.20nM. Assay description: Inhibition of 6-His-tagged recombinant full length BTK (unknown origin) expressed in baculovirus-transfected Sf9 cells using Biotin-EQEDEPEGDYFEWLE-N...
In DepthDetails ArticlePubMed