BDBM50233684 4-(2'-methoxy-biphenyl-3-sulfonyl)-5-methylsulfanyl-thiophene-2-carboxamidine::CHEMBL401087
SMILES COc1ccccc1-c1cccc(c1)S(=O)(=O)c1cc(sc1SC)C(N)=N
InChI Key InChIKey=QNXAEJSZENUITD-UHFFFAOYSA-N
Data  1 KI
  Tab Delimited (TSV)   2D SDfile   Computed 3D by Vconf -m prep SDfile
Find this compound or compounds like it in BindingDB:
Activity Spreadsheet -- Enzyme Inhibition Constant Data from BindingDB
Found 1 hit for monomerid = 50233684
TargetComplement C1s subcomponent(Homo sapiens (Human))
Johnson & Johnson Pharmaceutical Research And Development
Curated by ChEMBL
LigandPNGBDBM50233684(4-(2'-methoxy-biphenyl-3-sulfonyl)-5-methylsulfany...)
Affinity DataKi:  610nM. Assay description: Inhibition of Complement C1s subcomponent
In DepthDetails ArticlePubMed