BDBM50233746 CHEMBL4075046
SMILES NC(CC1CCCCC1)C(=O)NC(C1CCCCC1)C(=O)NCC(=O)N[C@@H](CCCNC(N)=N)C(N)=O
InChI Key InChIKey=BKDVNAXYVDQZKO-SCCNAQOGSA-N
Data  2 EC50
  Tab Delimited (TSV)   2D SDfile   Computed 3D by Vconf -m prep SDfile
Find this compound or compounds like it in BindingDB:
Activity Spreadsheet -- Enzyme Inhibition Constant Data from BindingDB
Found 2 hits for monomerid = 50233746
TargetProteinase-activated receptor 2(Homo sapiens (Human))
The University Of Queensland
Curated by ChEMBL
LigandPNGBDBM50233746(CHEMBL4075046)
Affinity DataEC50: >1.00E+5nM. Assay description: Agonist activity at human PAR2 expressed in CHO cells assessed as induction of intracellular calcium release measured for 300 secs by Fluo-3 AM dye-b...
In DepthDetails ArticlePubMed
TargetProteinase-activated receptor 2(Homo sapiens (Human))
The University Of Queensland
Curated by ChEMBL
LigandPNGBDBM50233746(CHEMBL4075046)
Affinity DataEC50: <1.00E+5nM. Assay description: Agonist activity at human PAR2 expressed in CHO cells assessed as induction of intracellular calcium release measured for 300 secs by Fluo-3 AM dye-b...
In DepthDetails ArticlePubMed