BDBM50234010 CHEMBL4065663
SMILES Cc1cc(O)c2C(=O)c3c(O)cc(O)c(Cl)c3C(=O)c2c1
InChI Key InChIKey=BHPXQYXFPVEKFE-UHFFFAOYSA-N
Data  1 IC50
  Tab Delimited (TSV)   2D SDfile   Computed 3D by Vconf -m prep SDfile
Find this compound or compounds like it in BindingDB:
Activity Spreadsheet -- Enzyme Inhibition Constant Data from BindingDB
Found 1 hit for monomerid = 50234010
TargetATP-citrate synthase(Homo sapiens (Human))
Harvard Medical School
Curated by ChEMBL
LigandPNGBDBM50234010(CHEMBL4065663)
Affinity DataIC50:  9.60E+3nM. Assay description: Inhibition of ATP citrate lyase (unknown origin) using sodium citrate as substrate after 60 mins by ADP-Glo luminescence assay
In DepthDetails ArticlePubMed