BDBM50234018 CHEMBL4099000
SMILES Cc1cc(O)c2C(=O)c3c(O)c4CN(COc4cc3C(=O)c2c1)c1ccccc1
InChI Key InChIKey=XEKNYEVCILLMDT-UHFFFAOYSA-N
Data  1 IC50
  Tab Delimited (TSV)   2D SDfile   Computed 3D by Vconf -m prep SDfile
Find this compound or compounds like it in BindingDB:
Activity Spreadsheet -- Enzyme Inhibition Constant Data from BindingDB
Found 1 hit for monomerid = 50234018
TargetATP-citrate synthase(Homo sapiens (Human))
Harvard Medical School
Curated by ChEMBL
LigandPNGBDBM50234018(CHEMBL4099000)
Affinity DataIC50:  2.58E+4nM. Assay description: Inhibition of ATP citrate lyase (unknown origin) using sodium citrate as substrate after 60 mins by ADP-Glo luminescence assay
In DepthDetails ArticlePubMed