BDBM50234103 CHEMBL4085937
SMILES Nc1nc(O[C@H](c2ccc(Cl)cc2-c2cc(F)cc(Cl)c2)C(F)(F)F)cc(n1)N1CCC2(CN[C@@H](C2)C(O)=O)CC1
InChI Key InChIKey=FDFADLULMIGCIA-NZQKXSOJSA-N
Data  1 IC50
  Tab Delimited (TSV)   2D SDfile   Computed 3D by Vconf -m prep SDfile
Find this compound or compounds like it in BindingDB:
Activity Spreadsheet -- Enzyme Inhibition Constant Data from BindingDB
Found 1 hit for monomerid = 50234103
TargetTryptophan 5-hydroxylase 1(Homo sapiens (Human))
Karos Pharmaceuticals
Curated by ChEMBL
LigandPNGBDBM50234103(CHEMBL4085937)
Affinity DataIC50:  35nM. Assay description: Inhibition of TPH1 (unknown origin)
In DepthDetails ArticlePubMed