BDBM50234460 CHEMBL4096617
SMILES NS(=O)(=O)c1ccc(CCN2C(=O)C=CC2=O)cc1
InChI Key InChIKey=VEQRFGXBRWISPW-UHFFFAOYSA-N
Data  4 KI
  Tab Delimited (TSV)   2D SDfile   Computed 3D by Vconf -m prep SDfile
Find this compound or compounds like it in BindingDB:
Activity Spreadsheet -- Enzyme Inhibition Constant Data from BindingDB
Found 4 hits for monomerid = 50234460
TargetCarbonic anhydrase 2(Homo sapiens (Human))
King Saud University
Curated by ChEMBL
LigandPNGBDBM50234460(CHEMBL4096617)
Affinity DataKi:  85nM. Assay description: Inhibition of recombinant human carbonic anhydrase 2 incubated for 10 mins prior to testing by stopped flow CO2 hydrase assay
In DepthDetails ArticlePubMed
TargetCarbonic anhydrase 9(Homo sapiens (Human))
King Saud University
Curated by ChEMBL
LigandPNGBDBM50234460(CHEMBL4096617)
Affinity DataKi:  274nM. Assay description: Inhibition of recombinant human carbonic anhydrase 9 incubated for 10 mins prior to testing by stopped flow CO2 hydrase assay
In DepthDetails ArticlePubMed
TargetCarbonic anhydrase 1(Homo sapiens (Human))
King Saud University
Curated by ChEMBL
LigandPNGBDBM50234460(CHEMBL4096617)
Affinity DataKi:  617nM. Assay description: Inhibition of recombinant human carbonic anhydrase 1 incubated for 10 mins prior to testing by stopped flow CO2 hydrase assay
In DepthDetails ArticlePubMed
TargetCarbonic anhydrase 4(Homo sapiens (Human))
King Saud University
Curated by ChEMBL
LigandPNGBDBM50234460(CHEMBL4096617)
Affinity DataKi:  4.85E+3nM. Assay description: Inhibition of recombinant human carbonic anhydrase 4 incubated for 10 mins prior to testing by stopped flow CO2 hydrase assay
In DepthDetails ArticlePubMed