BDBM50234583 CHEMBL4100047
SMILES COc1ccc(cc1C#Cc1cncc2ccccc12)C(=O)Nc1ccc(CN2CCN(C)CC2)c(c1)C(F)(F)F
InChI Key InChIKey=SRPADBYISZOWLI-UHFFFAOYSA-N
Data  1 IC50
  Tab Delimited (TSV)   2D SDfile   Computed 3D by Vconf -m prep SDfile
Find this compound or compounds like it in BindingDB:
Activity Spreadsheet -- Enzyme Inhibition Constant Data from BindingDB
Found 1 hit for monomerid = 50234583
TargetFibroblast growth factor receptor 1(Homo sapiens (Human))
Chinese Academy Of Sciences
Curated by ChEMBL
LigandPNGBDBM50234583(CHEMBL4100047)
Affinity DataIC50:  27nM. Assay description: Inhibition of recombinant FGFR1 (unknown origin) using poly (Glu, Tyr) 4:1 after 60 mins by ELISA method
In DepthDetails ArticlePubMed