BDBM50234807 CHEMBL1738733
SMILES O=C1N=C(Nc2ccccc2)N=C1Cc1ccc2OCOc2c1
InChI Key InChIKey=ZDINVWCJHPMIKS-UHFFFAOYSA-N
Data  2 IC50
PDB links: 4 PDB IDs match this monomer.
  Tab Delimited (TSV)   2D SDfile   Computed 3D by Vconf -m prep SDfile
Find this compound or compounds like it in BindingDB:
Activity Spreadsheet -- Enzyme Inhibition Constant Data from BindingDB
Found 2 hits for monomerid = 50234807
TargetDual specificity tyrosine-phosphorylation-regulated kinase 1A(Homo sapiens (Human))
Comenius University In Bratislava
Curated by ChEMBL
LigandPNGBDBM50234807(CHEMBL1738733)
Affinity DataIC50:  7.60nM. Assay description: Inhibition of DYRK1A (unknown origin)
TargetDual specificity tyrosine-phosphorylation-regulated kinase 1B(Homo sapiens (Human))
Comenius University In Bratislava
Curated by ChEMBL
LigandPNGBDBM50234807(CHEMBL1738733)
Affinity DataIC50:  37nM. Assay description: Inhibition of DYRK1B (unknown origin)
In DepthDetails ArticlePubMed