BDBM50234824 CHEMBL4095726
SMILES COc1cc2O\C(=C/c3cc(CN(C)C)c(O)c(CN(C)C)c3)C(=O)c2cc1OC
InChI Key InChIKey=HQRGSPXWVPUWHA-NKVSQWTQSA-N
Data  2 IC50
  Tab Delimited (TSV)   2D SDfile   Computed 3D by Vconf -m prep SDfile
Find this compound or compounds like it in BindingDB:
Activity Spreadsheet -- Enzyme Inhibition Constant Data from BindingDB
Found 2 hits for monomerid = 50234824
TargetAcetylcholinesterase(Electrophorus electricus (Electric eel))
Sichuan University
Curated by ChEMBL
LigandPNGBDBM50234824(CHEMBL4095726)
Affinity DataIC50:  5.72E+4nM. Assay description: Inhibition of Electrophorus electricus AChE using acetylthiocholine iodide as substrate measured after 15 mins by Ellman's method
In DepthDetails ArticlePubMed
TargetAcetylcholinesterase(Rattus norvegicus (rat))
Sichuan University
Curated by ChEMBL
LigandPNGBDBM50234824(CHEMBL4095726)
Affinity DataIC50:  2.33E+4nM. Assay description: Inhibition of AChE in rat brain cortex homogenates using acetylthiocholine iodide as substrate in presence of BuChE inhibitor tetraisopropyl pyrophos...
In DepthDetails ArticlePubMed