BDBM50234885 CHEMBL4092555
SMILES CSc1nc(c(-c2ccnc(Nc3ccc(NC(=O)c4cccc(NC(=O)C=C)c4)cc3C)c2)n1C)-c1ccc(F)cc1
InChI Key InChIKey=JSOCRZCXAZAHPO-UHFFFAOYSA-N
Data  2 IC50
  Tab Delimited (TSV)   2D SDfile   Computed 3D by Vconf -m prep SDfile
Find this compound or compounds like it in BindingDB:
Activity Spreadsheet -- Enzyme Inhibition Constant Data from BindingDB
Found 2 hits for monomerid = 50234885
TargetMitogen-activated protein kinase 14(Homo sapiens (Human))
Eberhard Karls Universit£T T£Bingen
Curated by ChEMBL
LigandPNGBDBM50234885(CHEMBL4092555)
Affinity DataIC50:  3nM. Assay description: Inhibition of GST-His tagged human p38alpha expressed in Escherichia coli assessed as reduction in ATF2 phosphorylation measured after 60 mins by ELI...
In DepthDetails ArticlePubMed
TargetMitogen-activated protein kinase 10(Homo sapiens (Human))
Eberhard Karls Universit£T T£Bingen
Curated by ChEMBL
LigandPNGBDBM50234885(CHEMBL4092555)
Affinity DataIC50:  2nM. Assay description: Inhibition of recombinant 6x-His-tagged JNK3 (39 to 402 residues) (unknown origin) expressed in Escherichia coli BL21(DE3) assessed as reduction in A...
In DepthDetails ArticlePubMed