BDBM50234928 CHEMBL4063947::US10239861, Example 2
SMILES CN1CCC(CC1)Nc1cnn(C)c(=O)c1Cl
InChI Key InChIKey=LOVWRUBZPXDPEX-UHFFFAOYSA-N
Data  3 IC50
  Tab Delimited (TSV)   2D SDfile   Computed 3D by Vconf -m prep SDfile
Find this compound or compounds like it in BindingDB:
Activity Spreadsheet -- Enzyme Inhibition Constant Data from BindingDB
Found 3 hits for monomerid = 50234928
TargetHistone acetyltransferase KAT2B(Homo sapiens (Human))
Glaxosmithkline
Curated by ChEMBL
LigandPNGBDBM50234928(CHEMBL4063947 | US10239861, Example 2)
Affinity DataIC50:  1.58E+4nM. Assay description: Displacement of GSK3103956A from FLAG-6 His-Halo tagged human PCAF bromodomain (715 to 831 residues) incubated for 30 mins in dark by TR-FRET assay
In DepthDetails ArticlePubMed
TargetHistone acetyltransferase KAT2B(Homo sapiens (Human))
Glaxosmithkline
Curated by ChEMBL
LigandPNGBDBM50234928(CHEMBL4063947 | US10239861, Example 2)
Affinity DataIC50:  1.22E+3nM. Assay description: His/Flag epitope tagged PCAF719-832 bromodomain was cloned, expressed and purified to homogeneity in-house. PCAF bromodomain binding and inhibition o...
In DepthDetails US Patent
TargetBromodomain-containing protein 9(Homo sapiens (Human))
Glaxosmithkline
Curated by ChEMBL
LigandPNGBDBM50234928(CHEMBL4063947 | US10239861, Example 2)
Affinity DataIC50: <5.01E+4nM. Assay description: Displacement of GSK2833930A from human BRD9 incubated for 30 mins in dark by TR-FRET assay
In DepthDetails ArticlePubMed