BDBM50234941 CHEMBL4071581
SMILES CC(C)Nc1cnn(C)c(=O)c1Cl
InChI Key InChIKey=ZBGVMZCTTBBSOI-UHFFFAOYSA-N
Data  2 IC50
  Tab Delimited (TSV)   2D SDfile   Computed 3D by Vconf -m prep SDfile
Find this compound or compounds like it in BindingDB:
Activity Spreadsheet -- Enzyme Inhibition Constant Data from BindingDB
Found 2 hits for monomerid = 50234941
TargetBromodomain-containing protein 9(Homo sapiens (Human))
Glaxosmithkline
Curated by ChEMBL
LigandPNGBDBM50234941(CHEMBL4071581)
Affinity DataIC50: <5.01E+4nM. Assay description: Displacement of GSK2833930A from human BRD9 incubated for 30 mins in dark by TR-FRET assay
In DepthDetails ArticlePubMed
TargetHistone acetyltransferase KAT2B(Homo sapiens (Human))
Glaxosmithkline
Curated by ChEMBL
LigandPNGBDBM50234941(CHEMBL4071581)
Affinity DataIC50:  3.16E+4nM. Assay description: Displacement of GSK3103956A from FLAG-6 His-Halo tagged human PCAF bromodomain (715 to 831 residues) incubated for 30 mins in dark by TR-FRET assay
In DepthDetails ArticlePubMed