BDBM50234956 CHEMBL4099159
SMILES [H][C@@]1(CC[C@@]2([H])[C@]3([H])CC[C@]4([H])C[C@H](O)CC[C@]4(C)[C@@]3([H])CC[C@]12C)[C@H](C)CCC(=O)N[C@H](CC(O)=O)c1ccccc1
InChI Key InChIKey=MMXSBHIHNUQNHB-MBSFSUHJSA-N
Data  1 IC50
  Tab Delimited (TSV)   2D SDfile   Computed 3D by Vconf -m prep SDfile
Find this compound or compounds like it in BindingDB:
Activity Spreadsheet -- Enzyme Inhibition Constant Data from BindingDB
Found 1 hit for monomerid = 50234956
TargetEphrin type-A receptor 2(Mus musculus)
Universit£
Curated by ChEMBL
LigandPNGBDBM50234956(CHEMBL4099159)
Affinity DataIC50:  1.40E+4nM. Assay description: Displacement of biotinylated ephrin-A1-Fc from recombinant mouse EphA2 receptor preincubated for 1 hr followed by biotinylated ephrin-A1-Fc addition ...
In DepthDetails ArticlePubMed