BDBM50235063 CHEMBL4061249
SMILES COc1cnc(N2CCOCC2)c2sc(NC(=O)C(C)(C)Oc3cccc(c3)C(F)(F)F)nc12
InChI Key InChIKey=DNOSWGLHBBLEQX-UHFFFAOYSA-N
Data  1 KI
  Tab Delimited (TSV)   2D SDfile   Computed 3D by Vconf -m prep SDfile
Find this compound or compounds like it in BindingDB:
Activity Spreadsheet -- Enzyme Inhibition Constant Data from BindingDB
Found 1 hit for monomerid = 50235063
TargetAdenosine receptor A2a(Homo sapiens (Human))
Advinus Therapeutics
Curated by ChEMBL
LigandPNGBDBM50235063(CHEMBL4061249)
Affinity DataKi:  24nM. Assay description: Displacement of [3H]ZM241385 from human adenosine A2A receptor expressed in HEK293 cell membranes measured after 90 mins
In DepthDetails ArticlePubMed