BDBM50235069 CHEMBL4075166
SMILES COc1cnc(N2CCOCC2)c2sc(NC(=O)C(C)(C)Oc3ccccc3F)nc12
InChI Key InChIKey=UHGAHHDHPVOIAI-UHFFFAOYSA-N
Data  1 KI
  Tab Delimited (TSV)   2D SDfile   Computed 3D by Vconf -m prep SDfile
Find this compound or compounds like it in BindingDB:
Activity Spreadsheet -- Enzyme Inhibition Constant Data from BindingDB
Found 1 hit for monomerid = 50235069
TargetAdenosine receptor A2a(Homo sapiens (Human))
Advinus Therapeutics
Curated by ChEMBL
LigandPNGBDBM50235069(CHEMBL4075166)
Affinity DataKi:  21nM. Assay description: Displacement of [3H]ZM241385 from human adenosine A2A receptor expressed in HEK293 cell membranes measured after 90 mins
In DepthDetails ArticlePubMed