BDBM50235185 CHEMBL4063541
SMILES Fc1ccc(c(F)c1)S(=O)(=O)Nc1cncc(c1)-c1ccc(s1)-c1ccc2CCNC(=O)c2c1
InChI Key InChIKey=YMQJMPPHSFJMIF-UHFFFAOYSA-N
Data  2 IC50
  Tab Delimited (TSV)   2D SDfile   Computed 3D by Vconf -m prep SDfile
Find this compound or compounds like it in BindingDB:
Activity Spreadsheet -- Enzyme Inhibition Constant Data from BindingDB
Found 2 hits for monomerid = 50235185
TargetPerforin-1(Homo sapiens (Human))
University Of Auckland
Curated by ChEMBL
LigandPNGBDBM50235185(CHEMBL4063541)
Affinity DataIC50:  2.00E+4nM. Assay description: Inhibition of recombinant Perforin-1 (unknown origin)
In DepthDetails PubMed
TargetPerforin-1(Homo sapiens (Human))
University Of Auckland
Curated by ChEMBL
LigandPNGBDBM50235185(CHEMBL4063541)
Affinity DataIC50: >2.00E+4nM. Assay description: In vitro 100 nM cortex affinity to displace [3H]- -pirenzepine providing a measure of muscarinic m1 receptor antagonist affinity
In DepthDetails ArticlePubMed