BDBM50235189 CHEMBL4060763
SMILES Fc1ccc(c(F)c1)S(=O)(=O)Nc1cncc(c1)-c1ccc(s1)-c1ccc2C(=O)NCc2c1
InChI Key InChIKey=LYYQKJRWLVLMHC-UHFFFAOYSA-N
Data  1 IC50
  Tab Delimited (TSV)   2D SDfile   Computed 3D by Vconf -m prep SDfile
Find this compound or compounds like it in BindingDB:
Activity Spreadsheet -- Enzyme Inhibition Constant Data from BindingDB
Found 1 hit for monomerid = 50235189
TargetPerforin-1(Homo sapiens (Human))
University Of Auckland
Curated by ChEMBL
LigandPNGBDBM50235189(CHEMBL4060763)
Affinity DataIC50:  6.87E+3nM. Assay description: In vitro 100 nM cortex affinity to displace [3H]- -pirenzepine providing a measure of muscarinic m1 receptor antagonist affinity
In DepthDetails ArticlePubMed