BDBM50235303 CHEMBL4095429
SMILES NC(=O)CNC(=O)Nc1ccc2ccn(-c3ccccc3Cl)c2c1
InChI Key InChIKey=CPNDBLSLLPFVIV-UHFFFAOYSA-N
Data  2 IC50
  Tab Delimited (TSV)   2D SDfile   Computed 3D by Vconf -m prep SDfile
Find this compound or compounds like it in BindingDB:
Activity Spreadsheet -- Enzyme Inhibition Constant Data from BindingDB
Found 2 hits for monomerid = 50235303
TargetHistone-lysine N-methyltransferase, H3 lysine-79 specific(Homo sapiens (Human))
Csir-Indian Institute Of Chemical Biology
Curated by ChEMBL
LigandPNGBDBM50235303(CHEMBL4095429)
Affinity DataIC50:  9.00E+3nM. Assay description: Inhibition of DOT1L (unknown origin)
In DepthDetails PubMed
TargetHistone-lysine N-methyltransferase, H3 lysine-79 specific(Homo sapiens (Human))
Csir-Indian Institute Of Chemical Biology
Curated by ChEMBL
LigandPNGBDBM50235303(CHEMBL4095429)
Affinity DataIC50:  7.94E+3nM. Assay description: Inhibition of DOT1L (2 to 416 residues) (unknown origin) using biotinylated nucleosomes as substrate preincubated for 30 mins followed by substrate a...
In DepthDetails ArticlePubMed