BDBM50235307 CHEMBL4061105
SMILES Cc1c(O)c2cc(Cl)ccc2nc1C(=O)NCCc1ccccc1
InChI Key InChIKey=GUKQCEOIUKJAQW-UHFFFAOYSA-N
Data  2 IC50
  Tab Delimited (TSV)   2D SDfile   Computed 3D by Vconf -m prep SDfile
Find this compound or compounds like it in BindingDB:
Activity Spreadsheet -- Enzyme Inhibition Constant Data from BindingDB
Found 2 hits for monomerid = 50235307
TargetProstaglandin G/H synthase 2(Homo sapiens (Human))
Al-Azhar University
Curated by ChEMBL
LigandPNGBDBM50235307(CHEMBL4061105)
Affinity DataIC50:  2.54E+3nM. Assay description: Inhibition of recombinant human COX2 using arachidonic acid as substrate assessed as decrease in PGF2 production preincubated for 15 mins followed by...
In DepthDetails ArticlePubMed
TargetProstaglandin G/H synthase 1(Ovis aries (Sheep))
Al-Azhar University
Curated by ChEMBL
LigandPNGBDBM50235307(CHEMBL4061105)
Affinity DataIC50:  1.14E+4nM. Assay description: Inhibition of ovine COX1 using arachidonic acid as substrate assessed as decrease in PGF2 production preincubated for 15 mins followed by substrate a...
In DepthDetails ArticlePubMed