BDBM50235342 CHEMBL319467::NU-6102
SMILES NS(=O)(=O)c1ccc(Nc2nc(OCC3CCCCC3)c3nc[nH]c3n2)cc1
InChI Key InChIKey=OWXORKPNCHJYOF-UHFFFAOYSA-N
Data  2 KI  22 IC50  1 Kd
PDB links: 9 PDB IDs match this monomer.
  Tab Delimited (TSV)   2D SDfile   Computed 3D by Vconf -m prep SDfile
Find this compound or compounds like it in BindingDB:
Activity Spreadsheet -- Enzyme Inhibition Constant Data from BindingDB
Found 25 hits for monomerid = 50235342
TargetCyclin-A2/Cyclin-dependent kinase 2(Homo sapiens (Human))
University Of South Australia Cancer Research Institute
Curated by ChEMBL
LigandPNGBDBM50235342(CHEMBL319467 | NU-6102)
Affinity DataKi:  6nM. Assay description: Inhibition of human CDK2/Cyclin A expressed in baculovirus infected Sf9 insect cells
TargetCyclin-dependent kinase 4/G1/S-specific cyclin-D1(Homo sapiens (Human))
University Of South Australia Cancer Research Institute
Curated by ChEMBL
LigandPNGBDBM50235342(CHEMBL319467 | NU-6102)
Affinity DataKi:  1.60E+3nM. Assay description: Inhibition of GST-tagged CDK4/Cyclin D1 (unknown origin) expressed in baculovirus infected insect cells using pRb (792 to 928 residues) as substrate
In DepthDetails ArticlePubMed
TargetCyclin-dependent kinase 2(Homo sapiens (Human))
Newcastle University
Curated by ChEMBL
LigandPNGBDBM50235342(CHEMBL319467 | NU-6102)
Affinity DataIC50:  5nM. Assay description: In vitro inhibitory concentration against angiotensin-converting enzyme
TargetCyclin-dependent kinase 5(Homo sapiens (Human))
Newcastle University
Curated by ChEMBL
LigandPNGBDBM50235342(CHEMBL319467 | NU-6102)
Affinity DataIC50:  480nM. Assay description: In vitro inhibitory concentration against angiotensin-converting enzyme
In DepthDetails ArticlePubMed
TargetCyclin-T1/Cyclin-dependent kinase 9(Homo sapiens (Human))
Newcastle University
Curated by ChEMBL
LigandPNGBDBM50235342(CHEMBL319467 | NU-6102)
Affinity DataIC50:  1.07E+3nM. Assay description: In vitro inhibitory concentration against angiotensin-converting enzyme
In DepthDetails ArticlePubMed
TargetCyclin-dependent kinase/G2/mitotic-specific cyclin- 1(Homo sapiens (Human))
Seoul National University
Curated by ChEMBL
LigandPNGBDBM50235342(CHEMBL319467 | NU-6102)
Affinity DataIC50:  9nM. Assay description: Inhibition of CDK1/cyclin B1 (unknown origin)
TargetCyclin-A2/Cyclin-dependent kinase 2(Homo sapiens (Human))
University Of South Australia Cancer Research Institute
Curated by ChEMBL
LigandPNGBDBM50235342(CHEMBL319467 | NU-6102)
Affinity DataIC50:  6nM. Assay description: Inhibition of CDK2/cyclin A (unknown origin)
TargetDual specificity tyrosine-phosphorylation-regulated kinase 1A(Homo sapiens (Human))
Seoul National University
Curated by ChEMBL
LigandPNGBDBM50235342(CHEMBL319467 | NU-6102)
Affinity DataIC50:  900nM. Assay description: Inhibition of DYRK1A (unknown origin)
In DepthDetails ArticlePubMed
TargetCyclin-dependent kinase/G2/mitotic-specific cyclin- 1(Homo sapiens (Human))
Seoul National University
Curated by ChEMBL
LigandPNGBDBM50235342(CHEMBL319467 | NU-6102)
Affinity DataIC50:  146nM. Assay description: Inhibition of His-tagged CDK1/cyclin B1 (unknown origin) expressed in Baculovirus infected Sf9 cells using histone H1 as substrate in presence of [ga...
TargetCyclin-dependent kinase 4/G1/S-specific cyclin-D1(Homo sapiens (Human))
University Of South Australia Cancer Research Institute
Curated by ChEMBL
LigandPNGBDBM50235342(CHEMBL319467 | NU-6102)
Affinity DataIC50:  184nM. Assay description: Inhibition of GST-tagged CDK4/cyclin D1 (unknown origin) expressed in Baculovirus infected Sf9 cells using RPPTLSPIPHIPR peptide as substrate in pres...
In DepthDetails ArticlePubMed
TargetCyclin-A2/Cyclin-dependent kinase 2(Homo sapiens (Human))
University Of South Australia Cancer Research Institute
Curated by ChEMBL
LigandPNGBDBM50235342(CHEMBL319467 | NU-6102)
Affinity DataIC50:  6nM. Assay description: Inhibition of human CDK2/cyclin A2
TargetCyclin-T1/Cyclin-dependent kinase 9(Homo sapiens (Human))
Newcastle University
Curated by ChEMBL
LigandPNGBDBM50235342(CHEMBL319467 | NU-6102)
Affinity DataIC50:  4.10E+3nM. Assay description: Inhibition of GST-tagged CDK9/CyclinT1 (unknown origin) expressed in Baculovirus infected Sf9 cells using YSPTSPS-2 KK peptide as substrate as substr...
In DepthDetails ArticlePubMed
TargetCyclin-dependent kinase 2/G1/S-specific cyclin-E1(Homo sapiens (Human))
Palack£
Curated by ChEMBL
LigandPNGBDBM50235342(CHEMBL319467 | NU-6102)
Affinity DataIC50:  22nM. Assay description: Inhibition of His-tagged CDK2/cyclin E (unknown origin) expressed in Baculovirus infected Sf9 cells using histone H1 as substrate in presence of [gam...
TargetCyclin-A2/Cyclin-dependent kinase 2(Homo sapiens (Human))
University Of South Australia Cancer Research Institute
Curated by ChEMBL
LigandPNGBDBM50235342(CHEMBL319467 | NU-6102)
Affinity DataIC50:  14nM. Assay description: Inhibition of GST-tagged CDK2/cyclin A2 (unknown origin) expressed in Escherichia coli using histone H1 as substrate in presence of [gamma-33P]-ATP b...
TargetCyclin-dependent kinase 5 activator 1(Homo sapiens (Human))
Palack£
Curated by ChEMBL
LigandPNGBDBM50235342(CHEMBL319467 | NU-6102)
Affinity DataIC50:  117nM. Assay description: Inhibition of GST-tagged CDK5/p25 (unknown origin) expressed in Baculovirus infected Sf9 cells using histone H1 as substrate as substrate in presence...
In DepthDetails ArticlePubMed
LigandPNGBDBM50235342(CHEMBL319467 | NU-6102)
Affinity DataIC50:  2.50E+3nM. Assay description: Inhibition of GST-tagged CDK7/cyclinH/MAT1 (unknown origin) expressed in Baculovirus infected Sf9 cells using YSPTSPS-2 KK peptide as substrate as su...
In DepthDetails ArticlePubMed
TargetCyclin-dependent kinase/G2/mitotic-specific cyclin- 1(Homo sapiens (Human))
Seoul National University
Curated by ChEMBL
LigandPNGBDBM50235342(CHEMBL319467 | NU-6102)
Affinity DataIC50:  250nM. Assay description: Inhibition of CDK1/Cyclin B (unknown origin)
TargetCyclin-A2/Cyclin-dependent kinase 2(Homo sapiens (Human))
University Of South Australia Cancer Research Institute
Curated by ChEMBL
LigandPNGBDBM50235342(CHEMBL319467 | NU-6102)
Affinity DataKd:  1.31E+3nM. Assay description: Binding affinity to recombinant human CDK2/CyclinA by SPR assay
TargetCyclin-dependent kinase 1(Homo sapiens (Human))
The First Affiliated Hospital Of Zhengzhou University
Curated by ChEMBL
LigandPNGBDBM50235342(CHEMBL319467 | NU-6102)
Affinity DataIC50:  5nM. Assay description: Inhibition of CDK1 (unknown origin)
TargetCyclin-dependent kinase 2(Homo sapiens (Human))
Newcastle University
Curated by ChEMBL
LigandPNGBDBM50235342(CHEMBL319467 | NU-6102)
Affinity DataIC50:  250nM. Assay description: Inhibition of CDK2 (unknown origin)
TargetCyclin-dependent kinase 7(Homo sapiens (Human))
The First Affiliated Hospital Of Zhengzhou University
Curated by ChEMBL
LigandPNGBDBM50235342(CHEMBL319467 | NU-6102)
Affinity DataIC50:  4.40E+3nM. Assay description: Inhibition of CDK7 (unknown origin)
In DepthDetails ArticlePubMed
TargetCyclin-dependent kinase 9(Homo sapiens (Human))
The First Affiliated Hospital Of Zhengzhou University
Curated by ChEMBL
LigandPNGBDBM50235342(CHEMBL319467 | NU-6102)
Affinity DataIC50:  1.10E+3nM. Assay description: Inhibition of CDK9 (unknown origin)
In DepthDetails ArticlePubMed
TargetCyclin-dependent kinase 2/G1/S-specific cyclin-E1(Homo sapiens (Human))
Palack£
Curated by ChEMBL
LigandPNGBDBM50235342(CHEMBL319467 | NU-6102)
Affinity DataIC50:  45nM. Assay description: Inhibition of CDK2/Cyclin E (unknown origin)
TargetCyclin-dependent kinase/G2/mitotic-specific cyclin- 1(Homo sapiens (Human))
Seoul National University
Curated by ChEMBL
LigandPNGBDBM50235342(CHEMBL319467 | NU-6102)
Affinity DataIC50:  250nM. Assay description: Inhibitory activity was determined against baker's yeast Alpha-Glucosidase
TargetCyclin-H/Cyclin-dependent kinase 7(Homo sapiens (Human))
Newcastle University
Curated by ChEMBL
LigandPNGBDBM50235342(CHEMBL319467 | NU-6102)
Affinity DataIC50:  4.40E+3nM. Assay description: In vitro inhibitory concentration against angiotensin-converting enzyme
In DepthDetails ArticlePubMed