BDBM50235348 CHEMBL4078988
SMILES CC(C)COc1nc(Nc2ccc(cc2)S(N)(=O)=O)nc2[nH]cnc12
InChI Key InChIKey=JHLUKNVQRJWHDL-UHFFFAOYSA-N
Data  1 IC50
  Tab Delimited (TSV)   2D SDfile   Computed 3D by Vconf -m prep SDfile
Find this compound or compounds like it in BindingDB:
Activity Spreadsheet -- Enzyme Inhibition Constant Data from BindingDB
Found 1 hit for monomerid = 50235348
TargetCyclin-A2(Bos taurus)
Newcastle University
Curated by ChEMBL
LigandPNGBDBM50235348(CHEMBL4078988)
Affinity DataIC50:  3nM. Assay description: Inhibition of human GST-tagged CDK2/bovine His-tagged Cyclin A
In DepthDetails ArticlePubMed