BDBM50235351 CHEMBL4102300
SMILES CC#Cc1nc(Nc2ccccc2)nc2[nH]cnc12
InChI Key InChIKey=CHJMRXSMMTXVCJ-UHFFFAOYSA-N
Data  1 IC50
  Tab Delimited (TSV)   2D SDfile   Computed 3D by Vconf -m prep SDfile
Find this compound or compounds like it in BindingDB:
Activity Spreadsheet -- Enzyme Inhibition Constant Data from BindingDB
Found 1 hit for monomerid = 50235351
TargetCyclin-A2(Bos taurus)
Newcastle University
Curated by ChEMBL
LigandPNGBDBM50235351(CHEMBL4102300)
Affinity DataIC50:  6.40E+3nM. Assay description: In vitro inhibitory concentration against angiotensin-converting enzyme
In DepthDetails ArticlePubMed